{"text_format":"1","workbook":"xlsx","n_sheets":3,"sheets":["자료","추출","틀"],"not_rendered":{"charts":0,"images":1,"macros":1,"external_links":0,"defined_names":3,"comments":1,"pivot_tables":0},"unopened":[],"bounds":{"document_bytes":16777216,"sheet_cells":100000,"rows_first":2000,"rows_last":500,"rows_between":2000,"halvings":0,"cell_chars":16384,"cell_head_chars":4096},"cells_cut":0,"cells_raw":0,"read":"whole","date_system":"1900"}

{"sheet":"자료","index":0,"n_rows":459,"n_cols":8,"rows_kept":459,"cut":false,"hidden":false,"merged":[]}
["순번","바코드","날짜",null,null,"순번","바코드","장소"]
[1,"*1300001*","2013-11-15",null,null,null,null,"2013-11-15"]
[2,"*1300002*","2013-11-15"]
[3,"*1300003*","2013-11-15"]
[4,"*1300004*","2013-11-15"]
[5,"*1300005*","2013-11-15"]
[6,"*1300006*","2013-11-15"]
[7,"*1300007*","2013-11-15"]
[8,"*1300008*","2013-11-15"]
[9,"*1300009*","2013-11-15"]
[10,"*1300010*","2013-11-15"]
[11,"*1300011*","2013-11-15"]
[12,"*1300012*","2013-11-15"]
[13,"*1300013*","2013-11-15"]
[14,"*1300014*","2013-11-15"]
[15,"*1300015*","2013-11-15"]
[16,"*1300016*","2013-11-15"]
[17,"*1300017*","2013-11-15"]
[18,"*1300018*","2013-11-15"]
[19,"*1300019*","2013-11-15"]
[20,"*1300020*","2013-11-15"]
[21,"*1300021*","2013-11-15"]
[22,"*1300022*","2013-11-15"]
[23,"*1300023*","2013-11-15"]
[24,"*1300024*","2013-11-15"]
[25,"*1300025*","2013-11-15"]
[26,"*1300026*","2013-11-15"]
[27,"*1300027*","2013-11-15"]
[28,"*1300028*","2013-11-15"]
[29,"*1300029*","2013-11-15"]
[30,"*1300030*","2013-11-15"]
[31,"*1300031*","2013-11-15"]
[32,"*1300032*","2013-11-15"]
[33,"*1300033*","2013-11-15"]
[34,"*1300034*","2013-11-15"]
[35,"*1300035*","2013-11-15"]
[36,"*1300036*","2013-11-15"]
[37,"*1300037*","2013-11-15"]
[38,"*1300038*","2013-11-15"]
[39,"*1300039*","2013-11-15"]
[40,"*1300040*","2013-11-15"]
[41,"*1300041*","2013-11-15"]
[42,"*1300042*","2013-11-15"]
[43,"*1300043*","2013-11-15"]
[44,"*1300044*","2013-11-15"]
[45,"*1300045*","2013-11-15"]
[46,"*1300046*","2013-11-15"]
[47,"*1300047*","2013-11-15"]
[48,"*1300048*","2013-11-15"]
[49,"*1300049*","2013-11-15"]
[50,"*1300050*","2013-11-15"]
[51,"*1300051*","2013-11-15"]
[52,"*1300052*","2013-11-15"]
[53,"*1300053*","2013-11-15"]
[54,"*1300054*","2013-11-15"]
[55,"*1300055*","2013-11-15"]
[56,"*1300056*","2013-11-15"]
[57,"*1300057*","2013-11-15"]
[58,"*1300058*","2013-11-15"]
[59,"*1300059*","2013-11-15"]
[60,"*1300060*","2013-11-15"]
[61,"*1300061*","2013-11-15"]
[62,"*1300062*","2013-11-15"]
[63,"*1300063*","2013-11-15"]
[64,"*1300064*","2013-11-15"]
[65,"*1300065*","2013-11-15"]
[66,"*1300066*","2013-11-15"]
[67,"*1300067*","2013-11-15"]
[68,"*1300068*","2013-11-15"]
[69,"*1300069*","2013-11-15"]
[70,"*1300070*","2013-11-15"]
[71,"*1300071*","2013-11-15"]
[72,"*1300072*","2013-11-15"]
[73,"*1300073*","2013-11-15"]
[74,"*1300074*","2013-11-15"]
[75,"*1300075*","2013-11-15"]
[76,"*1300076*","2013-11-15"]
[77,"*1300077*","2013-11-15"]
[78,"*1300078*","2013-11-15"]
[79,"*1300079*","2013-11-15"]
[80,"*1300080*","2013-11-15"]
[81,"*1300081*","2013-11-15"]
[82,"*1300082*","2013-11-15"]
[83,"*1300083*","2013-11-15"]
[84,"*1300084*","2013-11-15"]
[]
[]
[]
[]
[]
[]
[]
[]
[]
[]
[]
[]
[]
[]
[]
[]
[]
[]
[]
[]
[]
[]
[]
[]
[]
[]
[]
[]
[]
[]
[]
[]
[]
[]
[]
[]
[]
[]
[]
[]
[]
[]
[]
[]
[]
[]
[]
[]
[]
[]
[]
[]
[]
[]
[]
[]
[]
[]
[]
[]
[]
[]
[]
[]
[]
[]
[]
[]
[]
[]
[]
[]
[]
[]
[]
[]
[]
[]
[null,null,null,1]
[null,null,null,2]
[null,null,null,3]
[null,null,null,4]
[null,null,null,5]
[null,null,null,6]
[null,null,null,7]
[null,null,null,8]
[null,null,null,9]
[null,null,null,10]
[null,null,null,11]
[null,null,null,12]
[null,null,null,13]
[null,null,null,14]
[null,null,null,15]
[null,null,null,16]
[null,null,null,17]
[null,null,null,18]
[null,null,null,19]
[null,null,null,20]
[null,null,null,21]
[null,null,null,22]
[null,null,null,23]
[null,null,null,24]
[null,null,null,25]
[null,null,null,26]
[null,null,null,27]
[null,null,null,28]
[null,null,null,29]
[null,null,null,30]
[null,null,null,31]
[null,null,null,32]
[null,null,null,33]
[null,null,null,34]
[null,null,null,35]
[null,null,null,36]
[null,null,null,37]
[null,null,null,38]
[null,null,null,39]
[null,null,null,40]
[null,null,null,41]
[null,null,null,42]
[null,null,null,43]
[null,null,null,44]
[null,null,null,45]
[null,null,null,46]
[null,null,null,47]
[null,null,null,48]
[null,null,null,49]
[null,null,null,50]
[null,null,null,51]
[null,null,null,52]
[null,null,null,53]
[null,null,null,54]
[null,null,null,55]
[null,null,null,56]
[null,null,null,57]
[null,null,null,58]
[null,null,null,59]
[null,null,null,60]
[null,null,null,61]
[null,null,null,62]
[null,null,null,63]
[null,null,null,64]
[null,null,null,65]
[null,null,null,66]
[null,null,null,67]
[null,null,null,68]
[null,null,null,69]
[null,null,null,70]
[null,null,null,71]
[null,null,null,72]
[null,null,null,73]
[null,null,null,74]
[null,null,null,75]
[null,null,null,76]
[null,null,null,77]
[null,null,null,78]
[null,null,null,79]
[null,null,null,80]
[null,null,null,81]
[null,null,null,82]
[null,null,null,83]
[null,null,null,84]
[null,null,null,85]
[null,null,null,86]
[null,null,null,87]
[null,null,null,88]
[null,null,null,89]
[null,null,null,90]
[null,null,null,91]
[null,null,null,92]
[null,null,null,93]
[null,null,null,94]
[null,null,null,95]
[null,null,null,96]
[null,null,null,97]
[null,null,null,98]
[null,null,null,99]
[null,null,null,100]
[null,null,null,101]
[null,null,null,102]
[null,null,null,103]
[null,null,null,104]
[null,null,null,105]
[null,null,null,106]
[null,null,null,107]
[null,null,null,108]
[null,null,null,109]
[null,null,null,110]
[null,null,null,111]
[null,null,null,112]
[null,null,null,113]
[null,null,null,114]
[null,null,null,115]
[null,null,null,116]
[null,null,null,117]
[null,null,null,118]
[null,null,null,119]
[null,null,null,120]
[null,null,null,121]
[null,null,null,122]
[null,null,null,123]
[null,null,null,124]
[null,null,null,125]
[null,null,null,126]
[null,null,null,127]
[null,null,null,128]
[null,null,null,129]
[null,null,null,130]
[null,null,null,131]
[null,null,null,132]
[]
[]
[]
[]
[]
[]
[]
[]
[]
[]
[]
[]
[]
[]
[]
[]
[]
[]
[]
[]
[]
[]
[]
[]
[]
[]
[]
[]
[]
[]
[]
[]
[]
[]
[]
[]
[]
[]
[]
[]
[]
[]
[]
[]
[]
[]
[]
[]
[]
[]
[]
[]
[]
[]
[]
[]
[]
[]
[]
[]
[]
[]
[]
[]
[]
[]
[]
[]
[]
[]
[]
[]
[]
[]
[]
[]
[]
[]
[]
[]
[]
[]
[]
[]
[]
[]
[]
[]
[]
[]
[]
[]
[]
[]
[]
[]
[]
[]
[]
[]
[]
[]
[]
[]
[]
{"$rows_left_out":60}
{"sheet":"추출","index":1,"n_rows":127,"n_cols":4,"rows_kept":127,"cut":false,"hidden":false,"merged":[]}
["No.","순번","바코드","날짜"]
[1,1,"*1300001*","2013-11-15"]
[1001,2,"*1300002*","2013-11-15"]
[2001,3,"*1300003*","2013-11-15"]
[3001,4,"*1300004*","2013-11-15"]
[4001,5,"*1300005*","2013-11-15"]
[5001,6,"*1300006*","2013-11-15"]
[6001,7,"*1300007*","2013-11-15"]
[7001,8,"*1300008*","2013-11-15"]
[8001,9,"*1300009*","2013-11-15"]
[9001,10,"*1300010*","2013-11-15"]
[10001,11,"*1300011*","2013-11-15"]
[11001,12,"*1300012*","2013-11-15"]
[12001,13,"*1300013*","2013-11-15"]
[13001,14,"*1300014*","2013-11-15"]
[14001,15,"*1300015*","2013-11-15"]
[15001,16,"*1300016*","2013-11-15"]
[16001,17,"*1300017*","2013-11-15"]
[17001,18,"*1300018*","2013-11-15"]
[18001,19,"*1300019*","2013-11-15"]
[19001,20,"*1300020*","2013-11-15"]
[20001,21,"*1300021*","2013-11-15"]
[21001,22,"*1300022*","2013-11-15"]
[22001,23,"*1300023*","2013-11-15"]
[23001,24,"*1300024*","2013-11-15"]
[24001,25,"*1300025*","2013-11-15"]
[25001,26,"*1300026*","2013-11-15"]
[26001,27,"*1300027*","2013-11-15"]
[27001,28,"*1300028*","2013-11-15"]
[28001,29,"*1300029*","2013-11-15"]
[29001,30,"*1300030*","2013-11-15"]
[30001,31,"*1300031*","2013-11-15"]
[31001,32,"*1300032*","2013-11-15"]
[32001,33,"*1300033*","2013-11-15"]
[33001,34,"*1300034*","2013-11-15"]
[34001,35,"*1300035*","2013-11-15"]
[35001,36,"*1300036*","2013-11-15"]
[36001,37,"*1300037*","2013-11-15"]
[37001,38,"*1300038*","2013-11-15"]
[38001,39,"*1300039*","2013-11-15"]
[39001,40,"*1300040*","2013-11-15"]
[40001,41,"*1300041*","2013-11-15"]
[41001,42,"*1300042*","2013-11-15"]
[2,43,"*1300043*","2013-11-15"]
[1002,44,"*1300044*","2013-11-15"]
[2002,45,"*1300045*","2013-11-15"]
[3002,46,"*1300046*","2013-11-15"]
[4002,47,"*1300047*","2013-11-15"]
[5002,48,"*1300048*","2013-11-15"]
[6002,49,"*1300049*","2013-11-15"]
[7002,50,"*1300050*","2013-11-15"]
[8002,51,"*1300051*","2013-11-15"]
[9002,52,"*1300052*","2013-11-15"]
[10002,53,"*1300053*","2013-11-15"]
[11002,54,"*1300054*","2013-11-15"]
[12002,55,"*1300055*","2013-11-15"]
[13002,56,"*1300056*","2013-11-15"]
[14002,57,"*1300057*","2013-11-15"]
[15002,58,"*1300058*","2013-11-15"]
[16002,59,"*1300059*","2013-11-15"]
[17002,60,"*1300060*","2013-11-15"]
[18002,61,"*1300061*","2013-11-15"]
[19002,62,"*1300062*","2013-11-15"]
[20002,63,"*1300063*","2013-11-15"]
[21002,64,"*1300064*","2013-11-15"]
[22002,65,"*1300065*","2013-11-15"]
[23002,66,"*1300066*","2013-11-15"]
[24002,67,"*1300067*","2013-11-15"]
[25002,68,"*1300068*","2013-11-15"]
[26002,69,"*1300069*","2013-11-15"]
[27002,70,"*1300070*","2013-11-15"]
[28002,71,"*1300071*","2013-11-15"]
[29002,72,"*1300072*","2013-11-15"]
[30002,73,"*1300073*","2013-11-15"]
[31002,74,"*1300074*","2013-11-15"]
[32002,75,"*1300075*","2013-11-15"]
[33002,76,"*1300076*","2013-11-15"]
[34002,77,"*1300077*","2013-11-15"]
[35002,78,"*1300078*","2013-11-15"]
[36002,79,"*1300079*","2013-11-15"]
[37002,80,"*1300080*","2013-11-15"]
[38002,81,"*1300081*","2013-11-15"]
[39002,82,"*1300082*","2013-11-15"]
[40002,83,"*1300083*","2013-11-15"]
[41002,84,"*1300084*","2013-11-15"]
[3]
[1003]
[2003]
[3003]
[4003]
[5003]
[6003]
[7003]
[8003]
[9003]
[10003]
[11003]
[12003]
[13003]
[14003]
[15003]
[16003]
[17003]
[18003]
[19003]
[20003]
[21003]
[22003]
[23003]
[24003]
[25003]
[26003]
[27003]
[28003]
[29003]
[30003]
[31003]
[32003]
[33003]
[34003]
[35003]
[36003]
[37003]
[38003]
[39003]
[40003]
[41003]

{"sheet":"틀","index":2,"n_rows":56,"n_cols":11,"rows_kept":56,"cut":false,"hidden":false,"merged":[[5,0,6,0],[0,0,3,0],[0,1,3,1],[5,1,6,1],[0,2,3,2],[5,2,6,2],[0,3,3,3],[5,3,6,3],[0,4,3,4],[5,4,6,4],[0,5,3,5],[5,5,6,5],[13,5,14,5],[8,0,11,0],[8,1,11,1],[8,2,11,2],[8,3,11,3],[8,4,11,4],[8,5,11,5],[13,0,14,0],[13,1,14,1],[13,2,14,2],[13,3,14,3],[13,4,14,4],[21,5,22,5],[16,0,19,0],[16,1,19,1],[16,2,19,2],[16,3,19,3],[16,4,19,4],[16,5,19,5],[21,0,22,0],[21,1,22,1],[21,2,22,2],[21,3,22,3],[21,4,22,4],[29,5,30,5],[24,0,27,0],[24,1,27,1],[24,2,27,2],[24,3,27,3],[24,4,27,4],[24,5,27,5],[29,0,30,0],[29,1,30,1],[29,2,30,2],[29,3,30,3],[29,4,30,4],[37,5,38,5],[32,0,35,0],[32,1,35,1],[32,2,35,2],[32,3,35,3],[32,4,35,4],[32,5,35,5],[37,0,38,0],[37,1,38,1],[37,2,38,2],[37,3,38,3],[37,4,38,4],[45,5,46,5],[40,0,43,0],[40,1,43,1],[40,2,43,2],[40,3,43,3],[40,4,43,4],[40,5,43,5],[45,0,46,0],[45,1,46,1],[45,2,46,2],[45,3,46,3],[45,4,46,4],[53,5,54,5],[48,0,51,0],[48,1,51,1],[48,2,51,2],[48,3,51,3],[48,4,51,4],[48,5,51,5],[53,0,54,0],[53,1,54,1],[53,2,54,2],[53,3,54,3],[53,4,54,4]]}
[null,null,null,null,null,null,null,null,1,1,{"$f":"\" \"&DAY(TODAY())&\".\"","v":" 15."}]
[null,null,null,null,null,null,null,1000,{"$f":"H2+$I$1","v":1001},2,{"$f":"\" \"&MONTH(TODAY())&\".\"","v":" 11."}]
[null,null,null,null,null,null,null,2000,2001,3,{"$f":"\" \"&YEAR(TODAY())&\".\"","v":" 2013."}]
[null,null,null,null,null,null,null,3000,3001,4]
[{"$f":"\"조사일: \"&$K$3&$K$2&$K$1","v":"조사일:  2013. 11. 15."},"조사일:  2013. 11. 15.","조사일:  2013. 11. 15.","조사일:  2013. 11. 15.","조사일:  2013. 11. 15.","조사일:  2013. 11. 15.",null,4000,4001,5]
[{"$f":"VLOOKUP(I1,추출!$A$1:$L$127,3,FALSE)","v":"*1300001*"},{"$f":"VLOOKUP(I2,추출!$A$1:$L$127,3,FALSE)","v":"*1300002*"},{"$f":"VLOOKUP(I3,추출!$A$1:$L$127,3,FALSE)","v":"*1300003*"},{"$f":"VLOOKUP(I4,추출!$A$1:$L$127,3,FALSE)","v":"*1300004*"},{"$f":"VLOOKUP(I5,추출!$A$1:$L$127,3,FALSE)","v":"*1300005*"},{"$f":"VLOOKUP(I6,추출!$A$1:$L$127,3,FALSE)","v":"*1300006*"},null,5000,5001,6]
[null,null,null,null,null,null,null,6000,6001,7]
[{"$f":"MID(A6,2,7)","v":"1300001"},{"$f":"MID(B6,2,7)","v":"1300002"},"1300003","1300004","1300005","1300006",null,7000,7001,8]
[null,null,null,null,null,null,null,8000,8001,9]
[null,null,null,null,null,null,null,9000,9001,10]
[null,null,null,null,null,null,null,10000,10001,11]
[null,null,null,null,null,null,null,11000,11001,12]
[{"$f":"\"조사일: \"&$K$3&$K$2&$K$1","v":"조사일:  2013. 11. 15."},"조사일:  2013. 11. 15.","조사일:  2013. 11. 15.","조사일:  2013. 11. 15.","조사일:  2013. 11. 15.","조사일:  2013. 11. 15.",null,12000,12001,13]
[{"$f":"VLOOKUP(I7,추출!$A$1:$L$127,3,FALSE)","v":"*1300007*"},{"$f":"VLOOKUP(I8,추출!$A$1:$L$127,3,FALSE)","v":"*1300008*"},{"$f":"VLOOKUP(I9,추출!$A$1:$L$127,3,FALSE)","v":"*1300009*"},{"$f":"VLOOKUP(I10,추출!$A$1:$L$127,3,FALSE)","v":"*1300010*"},{"$f":"VLOOKUP(I11,추출!$A$1:$L$127,3,FALSE)","v":"*1300011*"},{"$f":"VLOOKUP(I12,추출!$A$1:$L$127,3,FALSE)","v":"*1300012*"},null,13000,13001,14]
[null,null,null,null,null,null,null,14000,14001,15]
[{"$f":"MID(A14,2,7)","v":"1300007"},"1300008","1300009","1300010","1300011","1300012",null,15000,15001,16]
[null,null,null,null,null,null,null,16000,16001,17]
[null,null,null,null,null,null,null,17000,17001,18]
[null,null,null,null,null,null,null,18000,18001,19]
[null,null,null,null,null,null,null,19000,19001,20]
[{"$f":"\"조사일: \"&$K$3&$K$2&$K$1","v":"조사일:  2013. 11. 15."},"조사일:  2013. 11. 15.","조사일:  2013. 11. 15.","조사일:  2013. 11. 15.","조사일:  2013. 11. 15.","조사일:  2013. 11. 15.",null,20000,20001,21]
[{"$f":"VLOOKUP(I13,추출!$A$1:$L$127,3,FALSE)","v":"*1300013*"},{"$f":"VLOOKUP(I14,추출!$A$1:$L$127,3,FALSE)","v":"*1300014*"},{"$f":"VLOOKUP(I15,추출!$A$1:$L$127,3,FALSE)","v":"*1300015*"},{"$f":"VLOOKUP(I16,추출!$A$1:$L$127,3,FALSE)","v":"*1300016*"},{"$f":"VLOOKUP(I17,추출!$A$1:$L$127,3,FALSE)","v":"*1300017*"},{"$f":"VLOOKUP(I18,추출!$A$1:$L$127,3,FALSE)","v":"*1300018*"},null,21000,21001,22]
[null,null,null,null,null,null,null,22000,22001,23]
[{"$f":"MID(A22,2,7)","v":"1300013"},"1300014","1300015","1300016","1300017","1300018",null,23000,23001,24]
[null,null,null,null,null,null,null,24000,24001,25]
[null,null,null,null,null,null,null,25000,25001,26]
[null,null,null,null,null,null,null,26000,26001,27]
[null,null,null,null,null,null,null,27000,27001,28]
[{"$f":"\"조사일: \"&$K$3&$K$2&$K$1","v":"조사일:  2013. 11. 15."},"조사일:  2013. 11. 15.","조사일:  2013. 11. 15.","조사일:  2013. 11. 15.","조사일:  2013. 11. 15.","조사일:  2013. 11. 15.",null,28000,28001,29]
[{"$f":"VLOOKUP(I19,추출!$A$1:$L$127,3,FALSE)","v":"*1300019*"},{"$f":"VLOOKUP(I20,추출!$A$1:$L$127,3,FALSE)","v":"*1300020*"},{"$f":"VLOOKUP(I21,추출!$A$1:$L$127,3,FALSE)","v":"*1300021*"},{"$f":"VLOOKUP(I22,추출!$A$1:$L$127,3,FALSE)","v":"*1300022*"},{"$f":"VLOOKUP(I23,추출!$A$1:$L$127,3,FALSE)","v":"*1300023*"},{"$f":"VLOOKUP(I24,추출!$A$1:$L$127,3,FALSE)","v":"*1300024*"},null,29000,29001,30]
[null,null,null,null,null,null,null,30000,30001,31]
[{"$f":"MID(A30,2,7)","v":"1300019"},"1300020","1300021","1300022","1300023","1300024",null,31000,31001,32]
[null,null,null,null,null,null,null,32000,32001,33]
[null,null,null,null,null,null,null,33000,33001,34]
[null,null,null,null,null,null,null,34000,34001,35]
[null,null,null,null,null,null,null,35000,35001,36]
[{"$f":"\"조사일: \"&$K$3&$K$2&$K$1","v":"조사일:  2013. 11. 15."},"조사일:  2013. 11. 15.","조사일:  2013. 11. 15.","조사일:  2013. 11. 15.","조사일:  2013. 11. 15.","조사일:  2013. 11. 15.",null,36000,36001,37]
[{"$f":"VLOOKUP(I25,추출!$A$1:$L$127,3,FALSE)","v":"*1300025*"},{"$f":"VLOOKUP(I26,추출!$A$1:$L$127,3,FALSE)","v":"*1300026*"},{"$f":"VLOOKUP(I27,추출!$A$1:$L$127,3,FALSE)","v":"*1300027*"},{"$f":"VLOOKUP(I28,추출!$A$1:$L$127,3,FALSE)","v":"*1300028*"},{"$f":"VLOOKUP(I29,추출!$A$1:$L$127,3,FALSE)","v":"*1300029*"},{"$f":"VLOOKUP(I30,추출!$A$1:$L$127,3,FALSE)","v":"*1300030*"},null,37000,37001,38]
[null,null,null,null,null,null,null,38000,38001,39]
[{"$f":"MID(A38,2,7)","v":"1300025"},"1300026","1300027","1300028","1300029","1300030",null,39000,39001,40]
[null,null,null,null,null,null,null,40000,40001,41]
[null,null,null,null,null,null,null,41000,41001,42]
[]
[]
[{"$f":"\"조사일: \"&$K$3&$K$2&$K$1","v":"조사일:  2013. 11. 15."},"조사일:  2013. 11. 15.","조사일:  2013. 11. 15.","조사일:  2013. 11. 15.","조사일:  2013. 11. 15.","조사일:  2013. 11. 15."]
[{"$f":"VLOOKUP(I31,추출!$A$1:$L$127,3,FALSE)","v":"*1300031*"},{"$f":"VLOOKUP(I32,추출!$A$1:$L$127,3,FALSE)","v":"*1300032*"},{"$f":"VLOOKUP(I33,추출!$A$1:$L$127,3,FALSE)","v":"*1300033*"},{"$f":"VLOOKUP(I34,추출!$A$1:$L$127,3,FALSE)","v":"*1300034*"},{"$f":"VLOOKUP(I35,추출!$A$1:$L$127,3,FALSE)","v":"*1300035*"},{"$f":"VLOOKUP(I36,추출!$A$1:$L$127,3,FALSE)","v":"*1300036*"}]
[]
[{"$f":"MID(A46,2,7)","v":"1300031"},"1300032","1300033","1300034","1300035","1300036"]
[]
[]
[]
[]
[{"$f":"\"조사일: \"&$K$3&$K$2&$K$1","v":"조사일:  2013. 11. 15."},"조사일:  2013. 11. 15.","조사일:  2013. 11. 15.","조사일:  2013. 11. 15.","조사일:  2013. 11. 15.","조사일:  2013. 11. 15."]
[{"$f":"VLOOKUP(I37,추출!$A$1:$L$127,3,FALSE)","v":"*1300037*"},{"$f":"VLOOKUP(I38,추출!$A$1:$L$127,3,FALSE)","v":"*1300038*"},{"$f":"VLOOKUP(I39,추출!$A$1:$L$127,3,FALSE)","v":"*1300039*"},{"$f":"VLOOKUP(I40,추출!$A$1:$L$127,3,FALSE)","v":"*1300040*"},{"$f":"VLOOKUP(I41,추출!$A$1:$L$127,3,FALSE)","v":"*1300041*"},{"$f":"VLOOKUP(I42,추출!$A$1:$L$127,3,FALSE)","v":"*1300042*"}]
[]
[{"$f":"MID(A54,2,7)","v":"1300037"},"1300038","1300039","1300040",{"$f":"MID(E54,2,7)","v":"1300041"},"1300042"]